{"text_format":"3","workbook":"xlsx","n_sheets":5,"sheets":["Table 0 (2)","Table 0","Events","Select PDGA Number","Player Summary"],"not_rendered":{"charts":3,"macros":1,"defined_names":3},"read":"whole","date_system":"1900"}

{"sheet":"Table 0 (2)","index":0,"n_rows":52,"n_cols":5,"rows_kept":52,"hidden":true}
["Effective Date","Year","Month","Rating","Rounds Used"]
["1998-08-08",{"$f":"YEAR(Player_Ratings[[#This Row],[Effective Date]])","v":1998},{"$f":"MONTH(Player_Ratings[[#This Row],[Effective Date]])","v":8},880,7]
["1999-04-25",{"$f":"YEAR(Player_Ratings[[#This Row],[Effective Date]])","v":1999},{"$f":"MONTH(Player_Ratings[[#This Row],[Effective Date]])","v":4},882,10]
["2000-04-30",{"$f":"YEAR(Player_Ratings[[#This Row],[Effective Date]])","v":2000},{"$f":"MONTH(Player_Ratings[[#This Row],[Effective Date]])","v":4},898,13]
["2000-08-27",{"$f":"YEAR(Player_Ratings[[#This Row],[Effective Date]])","v":2000},{"$f":"MONTH(Player_Ratings[[#This Row],[Effective Date]])","v":8},894,16]
["2000-12-16",{"$f":"YEAR(Player_Ratings[[#This Row],[Effective Date]])","v":2000},{"$f":"MONTH(Player_Ratings[[#This Row],[Effective Date]])","v":12},897,12]
["2001-04-29",{"$f":"YEAR(Player_Ratings[[#This Row],[Effective Date]])","v":2001},{"$f":"MONTH(Player_Ratings[[#This Row],[Effective Date]])","v":4},894,15]
["2002-03-31",{"$f":"YEAR(Player_Ratings[[#This Row],[Effective Date]])","v":2002},{"$f":"MONTH(Player_Ratings[[#This Row],[Effective Date]])","v":3},897,14]
["2002-05-27",{"$f":"YEAR(Player_Ratings[[#This Row],[Effective Date]])","v":2002},{"$f":"MONTH(Player_Ratings[[#This Row],[Effective Date]])","v":5},898,12]
["2002-12-31",{"$f":"YEAR(Player_Ratings[[#This Row],[Effective Date]])","v":2002},{"$f":"MONTH(Player_Ratings[[#This Row],[Effective Date]])","v":12},901,12]
["2003-03-15",{"$f":"YEAR(Player_Ratings[[#This Row],[Effective Date]])","v":2003},{"$f":"MONTH(Player_Ratings[[#This Row],[Effective Date]])","v":3},898,12]
["2004-02-15",{"$f":"YEAR(Player_Ratings[[#This Row],[Effective Date]])","v":2004},{"$f":"MONTH(Player_Ratings[[#This Row],[Effective Date]])","v":2},898,12]
["2004-05-15",{"$f":"YEAR(Player_Ratings[[#This Row],[Effective Date]])","v":2004},{"$f":"MONTH(Player_Ratings[[#This Row],[Effective Date]])","v":5},911,8]
["2004-09-15",{"$f":"YEAR(Player_Ratings[[#This Row],[Effective Date]])","v":2004},{"$f":"MONTH(Player_Ratings[[#This Row],[Effective Date]])","v":9},873,12]
["2005-05-15",{"$f":"YEAR(Player_Ratings[[#This Row],[Effective Date]])","v":2005},{"$f":"MONTH(Player_Ratings[[#This Row],[Effective Date]])","v":5},876,13]
["2005-07-15",{"$f":"YEAR(Player_Ratings[[#This Row],[Effective Date]])","v":2005},{"$f":"MONTH(Player_Ratings[[#This Row],[Effective Date]])","v":7},876,15]
["2005-09-15",{"$f":"YEAR(Player_Ratings[[#This Row],[Effective Date]])","v":2005},{"$f":"MONTH(Player_Ratings[[#This Row],[Effective Date]])","v":9},882,20]
["2006-04-18",{"$f":"YEAR(Player_Ratings[[#This Row],[Effective Date]])","v":2006},{"$f":"MONTH(Player_Ratings[[#This Row],[Effective Date]])","v":4},886,15]
["2006-06-27",{"$f":"YEAR(Player_Ratings[[#This Row],[Effective Date]])","v":2006},{"$f":"MONTH(Player_Ratings[[#This Row],[Effective Date]])","v":6},887,16]
["2006-09-19",{"$f":"YEAR(Player_Ratings[[#This Row],[Effective Date]])","v":2006},{"$f":"MONTH(Player_Ratings[[#This Row],[Effective Date]])","v":9},898,14]
{"$rows_left_out":33}
{"sheet":"Table 0","index":1,"n_rows":89,"n_cols":15,"rows_kept":89,"hidden":true}
["Tournament","Tier","Date","Tournament End Date","Year","Month","Division","Round","Score","Rating","Evaluated","Player Rating at time of round","Residual","Adjusted Round","Included"]
["The 42nd Annual Wintertime Open Presented by Paul McBeth (Pro Weekend)","A","14-Feb to 16-Feb-2020",{"$f":"DATEVALUE(IF(ISERROR(FIND(\"to\",C2,1))=TRUE,C2,RIGHT(C2,LEN(C2)-FIND(\"to\",C2,1)-2)))","v":"2020-02-16"},{"$f":"YEAR(Round_Ratings[[#This Row],[Tournament End Date]])","v":2020},{"$f":"MONTH(Round_Ratings[[#This Row],[Tournament End Date]])","v":2},"MP70","3",79,798,"Yes",{"$f":"INDEX('Table 0 (2)'!D:D,MATCH(Round_Ratings[[#This Row],[Tournament End Date]],'Table 0 (2)'!A:A,1),1)","v":815},{"$f":"Round_Ratings[[#This Row],[Rating]]-Round_Ratings[[#This Row],[Player Rating at time of round]]","v":-17},{"$f":"IF(ISERROR(_xlfn.NUMBERVALUE(Round_Ratings[[#This Row],[Round]]))=FALSE,_xlfn.NUMBERVALUE(Round_Ratings[[#This Row],[Round]]),COUNTIFS(A:A,Round_Ratings[[#This Row],[Tournament]],D:D,Round_Ratings[[#This Row],[Tournament End Date]]))","v":3},"Yes"]
["The 42nd Annual Wintertime Open Presented by Paul McBeth (Pro Weekend)","A","14-Feb to 16-Feb-2020","2020-02-16",{"$f":"YEAR(Round_Ratings[[#This Row],[Tournament End Date]])","v":2020},{"$f":"MONTH(Round_Ratings[[#This Row],[Tournament End Date]])","v":2},"MP70","2",82,771,"Yes",{"$f":"INDEX('Table 0 (2)'!D:D,MATCH(Round_Ratings[[#This Row],[Tournament End Date]],'Table 0 (2)'!A:A,1),1)","v":815},{"$f":"Round_Ratings[[#This Row],[Rating]]-Round_Ratings[[#This Row],[Player Rating at time of round]]","v":-44},{"$f":"IF(ISERROR(_xlfn.NUMBERVALUE(Round_Ratings[[#This Row],[Round]]))=FALSE,_xlfn.NUMBERVALUE(Round_Ratings[[#This Row],[Round]]),COUNTIFS(A:A,Round_Ratings[[#This Row],[Tournament]],D:D,Round_Ratings[[#This Row],[Tournament End Date]]))","v":2},"Yes"]
["The 42nd Annual Wintertime Open Presented by Paul McBeth (Pro Weekend)","A","14-Feb to 16-Feb-2020","2020-02-16",{"$f":"YEAR(Round_Ratings[[#This Row],[Tournament End Date]])","v":2020},{"$f":"MONTH(Round_Ratings[[#This Row],[Tournament End Date]])","v":2},"MP70","1",78,806,"Yes",{"$f":"INDEX('Table 0 (2)'!D:D,MATCH(Round_Ratings[[#This Row],[Tournament End Date]],'Table 0 (2)'!A:A,1),1)","v":815},{"$f":"Round_Ratings[[#This Row],[Rating]]-Round_Ratings[[#This Row],[Player Rating at time of round]]","v":-9},{"$f":"IF(ISERROR(_xlfn.NUMBERVALUE(Round_Ratings[[#This Row],[Round]]))=FALSE,_xlfn.NUMBERVALUE(Round_Ratings[[#This Row],[Round]]),COUNTIFS(A:A,Round_Ratings[[#This Row],[Tournament]],D:D,Round_Ratings[[#This Row],[Tournament End Date]]))","v":1},"Yes"]
["The Ed Headrick Disc Golf Hall of Fame Classic presented by REC TEC Grills - A Tier","A","11-Oct to 13-Oct-2019","2019-10-13",{"$f":"YEAR(Round_Ratings[[#This Row],[Tournament End Date]])","v":2019},{"$f":"MONTH(Round_Ratings[[#This Row],[Tournament End Date]])","v":10},"MP70","3",85,724,"Yes",{"$f":"INDEX('Table 0 (2)'!D:D,MATCH(Round_Ratings[[#This Row],[Tournament End Date]],'Table 0 (2)'!A:A,1),1)","v":816},{"$f":"Round_Ratings[[#This Row],[Rating]]-Round_Ratings[[#This Row],[Player Rating at time of round]]","v":-92},{"$f":"IF(ISERROR(_xlfn.NUMBERVALUE(Round_Ratings[[#This Row],[Round]]))=FALSE,_xlfn.NUMBERVALUE(Round_Ratings[[#This Row],[Round]]),COUNTIFS(A:A,Round_Ratings[[#This Row],[Tournament]],D:D,Round_Ratings[[#This Row],[Tournament End Date]]))","v":3},"No"]
["The Ed Headrick Disc Golf Hall of Fame Classic presented by REC TEC Grills - A Tier","A","11-Oct to 13-Oct-2019","2019-10-13",{"$f":"YEAR(Round_Ratings[[#This Row],[Tournament End Date]])","v":2019},{"$f":"MONTH(Round_Ratings[[#This Row],[Tournament End Date]])","v":10},"MP70","2",75,812,"Yes",{"$f":"INDEX('Table 0 (2)'!D:D,MATCH(Round_Ratings[[#This Row],[Tournament End Date]],'Table 0 (2)'!A:A,1),1)","v":816},{"$f":"Round_Ratings[[#This Row],[Rating]]-Round_Ratings[[#This Row],[Player Rating at time of round]]","v":-4},{"$f":"IF(ISERROR(_xlfn.NUMBERVALUE(Round_Ratings[[#This Row],[Round]]))=FALSE,_xlfn.NUMBERVALUE(Round_Ratings[[#This Row],[Round]]),COUNTIFS(A:A,Round_Ratings[[#This Row],[Tournament]],D:D,Round_Ratings[[#This Row],[Tournament End Date]]))","v":2},"Yes"]
["The Ed Headrick Disc Golf Hall of Fame Classic presented by REC TEC Grills - A Tier","A","11-Oct to 13-Oct-2019","2019-10-13",{"$f":"YEAR(Round_Ratings[[#This Row],[Tournament End Date]])","v":2019},{"$f":"MONTH(Round_Ratings[[#This Row],[Tournament End Date]])","v":10},"MP70","1",65,804,"Yes",{"$f":"INDEX('Table 0 (2)'!D:D,MATCH(Round_Ratings[[#This Row],[Tournament End Date]],'Table 0 (2)'!A:A,1),1)","v":816},{"$f":"Round_Ratings[[#This Row],[Rating]]-Round_Ratings[[#This Row],[Player Rating at time of round]]","v":-12},{"$f":"IF(ISERROR(_xlfn.NUMBERVALUE(Round_Ratings[[#This Row],[Round]]))=FALSE,_xlfn.NUMBERVALUE(Round_Ratings[[#This Row],[Round]]),COUNTIFS(A:A,Round_Ratings[[#This Row],[Tournament]],D:D,Round_Ratings[[#This Row],[Tournament End Date]]))","v":1},"Yes"]
["2019 World Flying Disc Federation Overall Championships Sponsored by Discraft- Disc Golf Event","XC","10-Jul-2019","2019-07-10",{"$f":"YEAR(Round_Ratings[[#This Row],[Tournament End Date]])","v":2019},{"$f":"MONTH(Round_Ratings[[#This Row],[Tournament End Date]])","v":7},"MPO","2",68,819,"Yes",{"$f":"INDEX('Table 0 (2)'!D:D,MATCH(Round_Ratings[[#This Row],[Tournament End Date]],'Table 0 (2)'!A:A,1),1)","v":824},{"$f":"Round_Ratings[[#This Row],[Rating]]-Round_Ratings[[#This Row],[Player Rating at time of round]]","v":-5},{"$f":"IF(ISERROR(_xlfn.NUMBERVALUE(Round_Ratings[[#This Row],[Round]]))=FALSE,_xlfn.NUMBERVALUE(Round_Ratings[[#This Row],[Round]]),COUNTIFS(A:A,Round_Ratings[[#This Row],[Tournament]],D:D,Round_Ratings[[#This Row],[Tournament End Date]]))","v":2},"Yes"]
["2019 World Flying Disc Federation Overall Championships Sponsored by Discraft- Disc Golf Event","XC","10-Jul-2019","2019-07-10",{"$f":"YEAR(Round_Ratings[[#This Row],[Tournament End Date]])","v":2019},{"$f":"MONTH(Round_Ratings[[#This Row],[Tournament End Date]])","v":7},"MPO","1",71,789,"Yes",{"$f":"INDEX('Table 0 (2)'!D:D,MATCH(Round_Ratings[[#This Row],[Tournament End Date]],'Table 0 (2)'!A:A,1),1)","v":824},{"$f":"Round_Ratings[[#This Row],[Rating]]-Round_Ratings[[#This Row],[Player Rating at time of round]]","v":-35},{"$f":"IF(ISERROR(_xlfn.NUMBERVALUE(Round_Ratings[[#This Row],[Round]]))=FALSE,_xlfn.NUMBERVALUE(Round_Ratings[[#This Row],[Round]]),COUNTIFS(A:A,Round_Ratings[[#This Row],[Tournament]],D:D,Round_Ratings[[#This Row],[Tournament End Date]]))","v":1},"Yes"]
["Pasadena Senior Olympics Disc Golf 2019","C","2-Jun-2019","2019-06-02",{"$f":"YEAR(Round_Ratings[[#This Row],[Tournament End Date]])","v":2019},{"$f":"MONTH(Round_Ratings[[#This Row],[Tournament End Date]])","v":6},"MP70","2",56,862,"Yes",{"$f":"INDEX('Table 0 (2)'!D:D,MATCH(Round_Ratings[[#This Row],[Tournament End Date]],'Table 0 (2)'!A:A,1),1)","v":812},{"$f":"Round_Ratings[[#This Row],[Rating]]-Round_Ratings[[#This Row],[Player Rating at time of round]]","v":50},{"$f":"IF(ISERROR(_xlfn.NUMBERVALUE(Round_Ratings[[#This Row],[Round]]))=FALSE,_xlfn.NUMBERVALUE(Round_Ratings[[#This Row],[Round]]),COUNTIFS(A:A,Round_Ratings[[#This Row],[Tournament]],D:D,Round_Ratings[[#This Row],[Tournament End Date]]))","v":2},"Yes"]
["Pasadena Senior Olympics Disc Golf 2019","C","2-Jun-2019","2019-06-02",{"$f":"YEAR(Round_Ratings[[#This Row],[Tournament End Date]])","v":2019},{"$f":"MONTH(Round_Ratings[[#This Row],[Tournament End Date]])","v":6},"MP70","1",57,850,"Yes",{"$f":"INDEX('Table 0 (2)'!D:D,MATCH(Round_Ratings[[#This Row],[Tournament End Date]],'Table 0 (2)'!A:A,1),1)","v":812},{"$f":"Round_Ratings[[#This Row],[Rating]]-Round_Ratings[[#This Row],[Player Rating at time of round]]","v":38},{"$f":"IF(ISERROR(_xlfn.NUMBERVALUE(Round_Ratings[[#This Row],[Round]]))=FALSE,_xlfn.NUMBERVALUE(Round_Ratings[[#This Row],[Round]]),COUNTIFS(A:A,Round_Ratings[[#This Row],[Tournament]],D:D,Round_Ratings[[#This Row],[Tournament End Date]]))","v":1},"Yes"]
["The 41st Annual Wintertime Open (Pros) Presented By Supreme Flight","A","15-Feb to 17-Feb-2019","2019-02-17",{"$f":"YEAR(Round_Ratings[[#This Row],[Tournament End Date]])","v":2019},{"$f":"MONTH(Round_Ratings[[#This Row],[Tournament End Date]])","v":2},"MP70","2",84,793,"Yes",{"$f":"INDEX('Table 0 (2)'!D:D,MATCH(Round_Ratings[[#This Row],[Tournament End Date]],'Table 0 (2)'!A:A,1),1)","v":802},{"$f":"Round_Ratings[[#This Row],[Rating]]-Round_Ratings[[#This Row],[Player Rating at time of round]]","v":-9},{"$f":"IF(ISERROR(_xlfn.NUMBERVALUE(Round_Ratings[[#This Row],[Round]]))=FALSE,_xlfn.NUMBERVALUE(Round_Ratings[[#This Row],[Round]]),COUNTIFS(A:A,Round_Ratings[[#This Row],[Tournament]],D:D,Round_Ratings[[#This Row],[Tournament End Date]]))","v":2},"Yes"]
["The 41st Annual Wintertime Open (Pros) Presented By Supreme Flight","A","15-Feb to 17-Feb-2019","2019-02-17",{"$f":"YEAR(Round_Ratings[[#This Row],[Tournament End Date]])","v":2019},{"$f":"MONTH(Round_Ratings[[#This Row],[Tournament End Date]])","v":2},"MP70","1",78,842,"Yes",{"$f":"INDEX('Table 0 (2)'!D:D,MATCH(Round_Ratings[[#This Row],[Tournament End Date]],'Table 0 (2)'!A:A,1),1)","v":802},{"$f":"Round_Ratings[[#This Row],[Rating]]-Round_Ratings[[#This Row],[Player Rating at time of round]]","v":40},{"$f":"IF(ISERROR(_xlfn.NUMBERVALUE(Round_Ratings[[#This Row],[Round]]))=FALSE,_xlfn.NUMBERVALUE(Round_Ratings[[#This Row],[Round]]),COUNTIFS(A:A,Round_Ratings[[#This Row],[Tournament]],D:D,Round_Ratings[[#This Row],[Tournament End Date]]))","v":1},"Yes"]
["The Ed Headrick Disc Golf Hall of Fame Classic presented by REC TEC Grills","A","12-Oct to 14-Oct-2018","2018-10-14",{"$f":"YEAR(Round_Ratings[[#This Row],[Tournament End Date]])","v":2018},{"$f":"MONTH(Round_Ratings[[#This Row],[Tournament End Date]])","v":10},"MP70","3",78,799,"No",{"$f":"INDEX('Table 0 (2)'!D:D,MATCH(Round_Ratings[[#This Row],[Tournament End Date]],'Table 0 (2)'!A:A,1),1)","v":800},{"$f":"Round_Ratings[[#This Row],[Rating]]-Round_Ratings[[#This Row],[Player Rating at time of round]]","v":-1},{"$f":"IF(ISERROR(_xlfn.NUMBERVALUE(Round_Ratings[[#This Row],[Round]]))=FALSE,_xlfn.NUMBERVALUE(Round_Ratings[[#This Row],[Round]]),COUNTIFS(A:A,Round_Ratings[[#This Row],[Tournament]],D:D,Round_Ratings[[#This Row],[Tournament End Date]]))","v":3},"No"]
["The Ed Headrick Disc Golf Hall of Fame Classic presented by REC TEC Grills","A","12-Oct to 14-Oct-2018","2018-10-14",{"$f":"YEAR(Round_Ratings[[#This Row],[Tournament End Date]])","v":2018},{"$f":"MONTH(Round_Ratings[[#This Row],[Tournament End Date]])","v":10},"MP70","2",82,800,"No",{"$f":"INDEX('Table 0 (2)'!D:D,MATCH(Round_Ratings[[#This Row],[Tournament End Date]],'Table 0 (2)'!A:A,1),1)","v":800},{"$f":"Round_Ratings[[#This Row],[Rating]]-Round_Ratings[[#This Row],[Player Rating at time of round]]","v":0},{"$f":"IF(ISERROR(_xlfn.NUMBERVALUE(Round_Ratings[[#This Row],[Round]]))=FALSE,_xlfn.NUMBERVALUE(Round_Ratings[[#This Row],[Round]]),COUNTIFS(A:A,Round_Ratings[[#This Row],[Tournament]],D:D,Round_Ratings[[#This Row],[Tournament End Date]]))","v":2},"No"]
["The Ed Headrick Disc Golf Hall of Fame Classic presented by REC TEC Grills","A","12-Oct to 14-Oct-2018","2018-10-14",{"$f":"YEAR(Round_Ratings[[#This Row],[Tournament End Date]])","v":2018},{"$f":"MONTH(Round_Ratings[[#This Row],[Tournament End Date]])","v":10},"MP70","1",77,808,"No",{"$f":"INDEX('Table 0 (2)'!D:D,MATCH(Round_Ratings[[#This Row],[Tournament End Date]],'Table 0 (2)'!A:A,1),1)","v":800},{"$f":"Round_Ratings[[#This Row],[Rating]]-Round_Ratings[[#This Row],[Player Rating at time of round]]","v":8},{"$f":"IF(ISERROR(_xlfn.NUMBERVALUE(Round_Ratings[[#This Row],[Round]]))=FALSE,_xlfn.NUMBERVALUE(Round_Ratings[[#This Row],[Round]]),COUNTIFS(A:A,Round_Ratings[[#This Row],[Tournament]],D:D,Round_Ratings[[#This Row],[Tournament End Date]]))","v":1},"No"]
["Pasadena Senior Games 2018","C","3-Jun-2018","2018-06-03",{"$f":"YEAR(Round_Ratings[[#This Row],[Tournament End Date]])","v":2018},{"$f":"MONTH(Round_Ratings[[#This Row],[Tournament End Date]])","v":6},"MP70","2",60,810,"No",{"$f":"INDEX('Table 0 (2)'!D:D,MATCH(Round_Ratings[[#This Row],[Tournament End Date]],'Table 0 (2)'!A:A,1),1)","v":801},{"$f":"Round_Ratings[[#This Row],[Rating]]-Round_Ratings[[#This Row],[Player Rating at time of round]]","v":9},{"$f":"IF(ISERROR(_xlfn.NUMBERVALUE(Round_Ratings[[#This Row],[Round]]))=FALSE,_xlfn.NUMBERVALUE(Round_Ratings[[#This Row],[Round]]),COUNTIFS(A:A,Round_Ratings[[#This Row],[Tournament]],D:D,Round_Ratings[[#This Row],[Tournament End Date]]))","v":2},"No"]
["Pasadena Senior Games 2018","C","3-Jun-2018","2018-06-03",{"$f":"YEAR(Round_Ratings[[#This Row],[Tournament End Date]])","v":2018},{"$f":"MONTH(Round_Ratings[[#This Row],[Tournament End Date]])","v":6},"MP70","1",62,785,"No",{"$f":"INDEX('Table 0 (2)'!D:D,MATCH(Round_Ratings[[#This Row],[Tournament End Date]],'Table 0 (2)'!A:A,1),1)","v":801},{"$f":"Round_Ratings[[#This Row],[Rating]]-Round_Ratings[[#This Row],[Player Rating at time of round]]","v":-16},{"$f":"IF(ISERROR(_xlfn.NUMBERVALUE(Round_Ratings[[#This Row],[Round]]))=FALSE,_xlfn.NUMBERVALUE(Round_Ratings[[#This Row],[Round]]),COUNTIFS(A:A,Round_Ratings[[#This Row],[Tournament]],D:D,Round_Ratings[[#This Row],[Tournament End Date]]))","v":1},"No"]
["40th Annual Wintertime Open - Pro presented by CalShieldHomeLoans.com","A","16-Feb to 18-Feb-2018","2018-02-18",{"$f":"YEAR(Round_Ratings[[#This Row],[Tournament End Date]])","v":2018},{"$f":"MONTH(Round_Ratings[[#This Row],[Tournament End Date]])","v":2},"MP70","3",82,799,"No",{"$f":"INDEX('Table 0 (2)'!D:D,MATCH(Round_Ratings[[#This Row],[Tournament End Date]],'Table 0 (2)'!A:A,1),1)","v":781},{"$f":"Round_Ratings[[#This Row],[Rating]]-Round_Ratings[[#This Row],[Player Rating at time of round]]","v":18},{"$f":"IF(ISERROR(_xlfn.NUMBERVALUE(Round_Ratings[[#This Row],[Round]]))=FALSE,_xlfn.NUMBERVALUE(Round_Ratings[[#This Row],[Round]]),COUNTIFS(A:A,Round_Ratings[[#This Row],[Tournament]],D:D,Round_Ratings[[#This Row],[Tournament End Date]]))","v":3},"No"]
["40th Annual Wintertime Open - Pro presented by CalShieldHomeLoans.com","A","16-Feb to 18-Feb-2018","2018-02-18",{"$f":"YEAR(Round_Ratings[[#This Row],[Tournament End Date]])","v":2018},{"$f":"MONTH(Round_Ratings[[#This Row],[Tournament End Date]])","v":2},"MP70","2",77,841,"No",{"$f":"INDEX('Table 0 (2)'!D:D,MATCH(Round_Ratings[[#This Row],[Tournament End Date]],'Table 0 (2)'!A:A,1),1)","v":781},{"$f":"Round_Ratings[[#This Row],[Rating]]-Round_Ratings[[#This Row],[Player Rating at time of round]]","v":60},{"$f":"IF(ISERROR(_xlfn.NUMBERVALUE(Round_Ratings[[#This Row],[Round]]))=FALSE,_xlfn.NUMBERVALUE(Round_Ratings[[#This Row],[Round]]),COUNTIFS(A:A,Round_Ratings[[#This Row],[Tournament]],D:D,Round_Ratings[[#This Row],[Tournament End Date]]))","v":2},"No"]
{"$rows_left_out":70}
{"sheet":"Events","index":2,"n_rows":35,"n_cols":4,"rows_kept":35,"hidden":true}
["Tournament","Event Average Rating","Event Date","Year"]
["Ice Bowl in Paradise",906,"2005-01-29",2005]
["30th Wintertime Open",900.3,"2008-02-17",2008]
["Fling X",896,"2006-06-03",2006]
["Ice Bowl in Paradise",894.5,"2006-01-28",2006]
["Fling XII",880,"2008-05-17",2008]
["28th Wintertime Open",875.3,"2006-02-19",2006]
["32nd Wintertime Open",873.3,"2010-02-14",2010]
["Fling XIII",873,"2009-05-16",2009]
["31st Wintertime Open",873,"2009-02-15",2009]
["WFDF World Overall Championships",872.3,"2005-07-01",2005]
["35th Annual Wintertime Open - Pro",867,"2013-02-17",2013]
["Ice Bowl In Paradise",867,"2010-01-23",2010]
["US Open Flying Disc Championships",865.3,"2008-07-19",2008]
["33rd Annual Wintertime Open",863,"2011-02-20",2011]
["Pasadena Senior Olympics Disc Golf 2019",856,"2019-06-02",2019]
["2010 PDGA Professional Disc Golf World Championships",842.8,"2010-07-31",2010]
["34th annual Wintertime Open - Pro",836.7,"2012-02-19",2012]
["Kiss The Sky",834.5,"2006-07-23",2006]
["37th Annual Wintertime Open - PRO",828.3,"2015-02-15",2015]
{"$rows_left_out":16}
{"sheet":"Select PDGA Number","index":3,"n_rows":2,"n_cols":1,"rows_kept":2}
["PDGA"]
["3"]

{"sheet":"Player Summary","index":4,"n_rows":18,"n_cols":2,"rows_kept":18,"hidden":true}
["Most Recent 10% of Rounds"]
["Average",{"v":798.3333333333334,"d":"798.3"}]
["% Positive Rounds",{"v":0.1111111111111111,"d":"11.1%"}]
["Average positive Difference ",{"v":50,"d":"50.0"}]
["Average negative Difference",{"v":-27.25,"d":"-27.3"}]
["Rating Trend Score",-18.7]
[]
["Previous 10% of Rounds"]
["Average",{"v":809.5555555555555,"d":"809.6"}]
["% Positive Rounds",{"v":0.5555555555555556,"d":"55.6%"}]
["Average Positive Difference",22.6]
["Average Negative Difference",{"v":-8.666666666666666,"d":"-8.7"}]
["Rating Trend Score","+8.7"]
[]
["Top Events All Time"]
[{"$f":"IF(ISBLANK(Events!A2)=TRUE(),\"More tournaments needed\",Events!A2&\" - \"&Events!D2)","v":"Ice Bowl in Paradise - 2005"},906]
[{"$f":"IF(ISBLANK(Events!A3)=TRUE(),\"More tournaments needed\",Events!A3&\" - \"&Events!D3)","v":"30th Wintertime Open - 2008"},900.3]
[{"$f":"IF(ISBLANK(Events!A4)=TRUE(),\"More tournaments needed\",Events!A4&\" - \"&Events!D4)","v":"Fling X - 2006"},896]